Reaction Details
TargetComplement C1s subcomponent
LigandBDBM86154
Substrate/Competitorn/a
Meas. Tech.Enzymatic Assay
pH8.05±0
Temperature298.65±0 K
Ki 18100000±0.0 nM
Citation Bing, DH Nature of the active site of a subunit of the first component of human complement. Biochemistry8:4503-10 (1969) 
 
Complement C1s subcomponent
Name:Complement C1s subcomponent
Type:Protein
Mol. Mass.:76657.91
Organism:Homo sapiens (Human)
Description:P09871
Residue:688
BDBM86154
NameBDBM86154
Synonyms:Aminoguanidine NSC_2146
TypeSmall organic molecule
Emp. Form.CH6N4
Mol. Mass.74.0851
SMILES[#7]\[#7]=[#6](\[#7])-[#7]