Reaction Details
TargetComplement C1s subcomponent
LigandBDBM93099
Substrate/Competitorn/a
Meas. Tech.Enzymatic Assay
pH8.05±0
Temperature298.65±0 K
Ki 92500000±0.0 nM
Citation Bing, DH Nature of the active site of a subunit of the first component of human complement. Biochemistry8:4503-10 (1969) 
 
Complement C1s subcomponent
Name:Complement C1s subcomponent
Type:Protein
Mol. Mass.:76657.91
Organism:Homo sapiens (Human)
Description:P09871
Residue:688
BDBM93099
NameBDBM93099
Synonyms:p-Nitrobenzamidine
TypeSmall molecule
Emp. Form.C7H7N3O2
Mol. Mass.165.1494
SMILESNC(=N)c1ccc(cc1)[N+]([O-])=O