Reaction Details
TargetComplement C1s subcomponent
LigandBDBM772
Substrate/Competitorn/a
Meas. Tech.Enzymatic Assay
pH8.05±0
Temperature298.65±0 K
Ki 603000±0.0 nM
Citation Bing, DH Nature of the active site of a subunit of the first component of human complement. Biochemistry8:4503-10 (1969) 
 
Complement C1s subcomponent
Name:Complement C1s subcomponent
Type:Protein
Mol. Mass.:76657.91
Organism:Homo sapiens (Human)
Description:P09871
Residue:688
BDBM772
NameBDBM772
Synonyms:Benzamidine [amino(phenyl)methylidene]azanium benzamidinium chloride
Typen/a
Emp. Form.C7H9N2
Mol. Mass.121.1592
SMILESNC(=[NH2+])c1ccccc1