Reaction Details
TargetComplement C1s subcomponent
LigandBDBM93101
Substrate/Competitorn/a
Meas. Tech.Enzymatic Assay
pH8.05±0
Temperature298.65±0 K
Ki 1120000±0.0 nM
Citation Bing, DH Nature of the active site of a subunit of the first component of human complement. Biochemistry8:4503-10 (1969) 
 
Complement C1s subcomponent
Name:Complement C1s subcomponent
Type:Protein
Mol. Mass.:76657.91
Organism:Homo sapiens (Human)
Description:P09871
Residue:688
BDBM93101
NameBDBM93101
Synonyms:N-Chloroacetyl-L-tyrosine
TypeSmall molecule
Emp. Form.C11H11ClNO4
Mol. Mass.256.663
SMILESOc1ccc(CC(NC(=O)CCl)C([O-])=O)cc1