Reaction Details
TargetDNA ligase A
LigandBDBM93107
Substrate/Competitorn/a
Meas. Tech.Enzyme Assay
IC50 4.60e+4± 2.5e+3 nM
Citation Dube, CKukshal, VSrivastava, SKTripathi, RPRamachandran, R NAD+-dependent DNA ligase (Rv3014c) from M. tuberculosis: Strategies for inhibitor design Medicinal Chemistry Research17:189-198 (2008)  
 
DNA ligase A
Name:DNA ligase A
Type:Enzyme
Mol. Mass.:75276.13
Organism:Mycobacterium tuberculosis
Description:The C-terminally His-tagged full-length MtuLigA protein was cloned and expressed in E. coli.
Residue:691
BDBM93107
NameBDBM93107
Synonyms:Arylamino compound, 1
TypeSmall molecule
Emp. Form.C18H28ClN3
Mol. Mass.321.888
SMILESCCN(CC)CCCC(C)Nc1ccnc2CC(Cl)C=Cc12