Reaction Details
TargetDNA ligase A
LigandBDBM22986
Substrate/Competitorn/a
Meas. Tech.Enzyme Assay
IC50 1.35e+4± 6e+2 nM
Citation Dube, CKukshal, VSrivastava, SKTripathi, RPRamachandran, R NAD+-dependent DNA ligase (Rv3014c) from M. tuberculosis: Strategies for inhibitor design Medicinal Chemistry Research17:189-198 (2008)  
 
DNA ligase A
Name:DNA ligase A
Type:Enzyme
Mol. Mass.:75276.13
Organism:Mycobacterium tuberculosis
Description:The C-terminally His-tagged full-length MtuLigA protein was cloned and expressed in E. coli.
Residue:691
BDBM22986
NameBDBM22986
Synonyms:18-[6-(piperidin-1-yl)hexyl]-8-thia-18-azatetracyclo[9.7.0.0^{2,7}.0^{12,17}]octadeca-1(11),2(7),3,5,12(17),13,15-heptaene Tetracyclic indole derivative, 5
TypeSmall organic molecule
Emp. Form.C27H34N2S
Mol. Mass.418.637
SMILESC(CCCn1c-2c(CCSc3ccccc-23)c2ccccc12)CCN1CCCCC1