Reaction Details
TargetCytochrome P450 2C19
LigandBDBM93133
Substrate/Competitorn/a
Meas. Tech.CYP Inhibition Assay
IC50 1.2e+2± 6e+1 nM
Citation Badal, SGallimore, WHuang, GTzeng, TRDelgoda, R Cytotoxic and potent CYP1 inhibitors from the marine algae Cymopolia barbata. Org Med Chem Lett2:21 (2012) 
 
Cytochrome P450 2C19
Name:Cytochrome P450 2C19
Type:Enzyme
Mol. Mass.:55935.47
Organism:Homo sapiens (Human)
Description:P33261
Residue:490
BDBM93133
NameBDBM93133
Synonyms:PBQ2
TypeSmall molecule
Emp. Form.C16H21BrO4
Mol. Mass.357.24
SMILESCC(CCCC(C)(C)O)=CC(=O)c1cc(O)c(Br)cc1O