Reaction Details
TargetGenome polyprotein
LigandBDBM50022180
Substrate/Competitorn/a
Meas. Tech.NS5B Inhibition Assay
pH7±0
Temperature303.15±0 K
IC50 4.72e+4± 5.1e+3 nM
Citation Nichols, DBLeão, RABasu, AChudayeu, Mde Moraes, Pde FTalele, TTCosta, PRKaushik-Basu, N Evaluation of Coumarin and Neoflavone Derivatives as HCV NS5B Polymerase Inhibitors. Chem Biol Drug Des81:607-14 (2013) 
 
Genome polyprotein
Name:Genome polyprotein
Type:Protein
Mol. Mass.:327252.46
Organism:Hepatitis C virus genotype 1b (isolate BK) (HCV)
Description:P26663
Residue:3010
BDBM50022180
NameBDBM50022180
Synonyms:5,7-Dihydroxy-4-methyl-2H-chromen-2-one (2) 5,7-dihydroxy-4-methyl-2H-chromen-2-one Coumarin derivative, 1b
TypeSmall organic molecule
Emp. Form.C10H8O4
Mol. Mass.192.1681
SMILESCc1cc(=O)oc2cc(O)cc(O)c12