Reaction Details
TargetL-lactate dehydrogenase
LigandBDBM23222
Substrate/Competitorn/a
Meas. Tech.Enzyme Assay
IC50 9.44e+4±n/a nM
Citation Choi, SRBeeler, ABPradhan, AWatkins, EBRimoldi, JMTekwani, BAvery, MA Generation of oxamic acid libraries: antimalarials and inhibitors of Plasmodium falciparum lactate dehydrogenase. J Comb Chem9:292-300 (2007) 
 
L-lactate dehydrogenase
Name:L-lactate dehydrogenase
Synonyms:Lactate dehydrogenase (LDH)
Type:Protein
Mol. Mass.:28939.78
Organism:Plasmodium falciparum
Description:B9UDZ5
Residue:267
BDBM23222
NameBDBM23222
TypeSmall organic molecule
Emp. Form.C2H3NO3
Mol. Mass.89.0501
SMILESNC(=O)C(O)=O