Reaction Details
TargetL-lactate dehydrogenase
LigandBDBM93299
Substrate/Competitorn/a
Meas. Tech.Enzyme Assay
IC50 4.3e+4±n/a nM
Citation Choi, SRBeeler, ABPradhan, AWatkins, EBRimoldi, JMTekwani, BAvery, MA Generation of oxamic acid libraries: antimalarials and inhibitors of Plasmodium falciparum lactate dehydrogenase. J Comb Chem9:292-300 (2007) 
 
L-lactate dehydrogenase
Name:L-lactate dehydrogenase
Synonyms:Lactate dehydrogenase (LDH)
Type:Protein
Mol. Mass.:28939.78
Organism:Plasmodium falciparum
Description:B9UDZ5
Residue:267
BDBM93299
NameBDBM93299
Synonyms:Oxamic Acid/Ester, 17
TypeSmall molecule
Emp. Form.C13H11NO3
Mol. Mass.229.2313
SMILESOC(=O)C(=O)NCc1cccc2ccccc12