Reaction Details
TargetL-lactate dehydrogenase
LigandBDBM93304
Substrate/Competitorn/a
Meas. Tech.Enzyme Assay
IC50>2.00e+5±n/a nM
Citation Choi, SRBeeler, ABPradhan, AWatkins, EBRimoldi, JMTekwani, BAvery, MA Generation of oxamic acid libraries: antimalarials and inhibitors of Plasmodium falciparum lactate dehydrogenase. J Comb Chem9:292-300 (2007) 
 
L-lactate dehydrogenase
Name:L-lactate dehydrogenase
Synonyms:Lactate dehydrogenase (LDH)
Type:Protein
Mol. Mass.:28939.78
Organism:Plasmodium falciparum
Description:B9UDZ5
Residue:267
BDBM93304
NameBDBM93304
Synonyms:Oxamic Acid/Ester, 22
TypeSmall molecule
Emp. Form.C15H13NO3
Mol. Mass.255.2686
SMILESOC(=O)C(=O)N(Cc1ccccc1)c1ccccc1