Reaction Details
TargetL-lactate dehydrogenase
LigandBDBM93306
Substrate/Competitorn/a
Meas. Tech.Enzyme Assay
IC50>2.00e+5±n/a nM
Citation Choi, SRBeeler, ABPradhan, AWatkins, EBRimoldi, JMTekwani, BAvery, MA Generation of oxamic acid libraries: antimalarials and inhibitors of Plasmodium falciparum lactate dehydrogenase. J Comb Chem9:292-300 (2007) 
 
L-lactate dehydrogenase
Name:L-lactate dehydrogenase
Synonyms:Lactate dehydrogenase (LDH)
Type:Protein
Mol. Mass.:28939.78
Organism:Plasmodium falciparum
Description:B9UDZ5
Residue:267
BDBM93306
NameBDBM93306
Synonyms:Oxamic Acid/Ester, 24
TypeSmall molecule
Emp. Form.C9H9NO3
Mol. Mass.179.1727
SMILESCN(C(=O)C(O)=O)c1ccccc1