Reaction Details
TargetL-lactate dehydrogenase
LigandBDBM93318
Substrate/Competitorn/a
Meas. Tech.Enzyme Assay
IC50 3.5e+4±n/a nM
Citation Choi, SRBeeler, ABPradhan, AWatkins, EBRimoldi, JMTekwani, BAvery, MA Generation of oxamic acid libraries: antimalarials and inhibitors of Plasmodium falciparum lactate dehydrogenase. J Comb Chem9:292-300 (2007) 
 
L-lactate dehydrogenase
Name:L-lactate dehydrogenase
Synonyms:Lactate dehydrogenase (LDH)
Type:Protein
Mol. Mass.:28939.78
Organism:Plasmodium falciparum
Description:B9UDZ5
Residue:267
BDBM93318
NameBDBM93318
Synonyms:Oxamic Acid/Ester, 36
TypeSmall molecule
Emp. Form.C17H17NO3
Mol. Mass.283.3218
SMILESOC(=O)C(=O)NCCC(c1ccccc1)c1ccccc1