Reaction Details
TargetL-lactate dehydrogenase
LigandBDBM93296
Substrate/Competitorn/a
Meas. Tech.Enzyme Assay
IC50 1.50e+5±n/a nM
Citation Choi, SRBeeler, ABPradhan, AWatkins, EBRimoldi, JMTekwani, BAvery, MA Generation of oxamic acid libraries: antimalarials and inhibitors of Plasmodium falciparum lactate dehydrogenase. J Comb Chem9:292-300 (2007) 
 
L-lactate dehydrogenase
Name:L-lactate dehydrogenase
Synonyms:Lactate dehydrogenase (LDH)
Type:Protein
Mol. Mass.:36018.34
Organism:Bos taurus (Bovine)
Description:E1BNS9
Residue:332
BDBM93296
NameBDBM93296
Synonyms:Oxamic Acid/Ester, 14
TypeSmall molecule
Emp. Form.C18H35NO3
Mol. Mass.313.4754
(=O)C(O)=O