Reaction Details
TargetProtein Wnt-3a
LigandBDBM37170
Substrate/Competitorn/a
IC50 1890±n/a nM
Citation PubChem, PC Dose response validation of uHTS Gli-SUFU antagonist hits in a Wnt3a luminescent reporter assay PubChem Bioassay(2012)[AID]
 
Protein Wnt-3a
Name:Protein Wnt-3a
Type:PROTEIN
Mol. Mass.:39269.29
Organism:Mus musculus
Description:ChEMBL_813156
Residue:352
BDBM37170
NameBDBM37170
Synonyms:3-methyl-4-oxo-6-(3,4,5-trimethoxyphenyl)-1,5,6,7-tetrahydroindole-2-carboxylic acid prop-2-enyl ester MLS000116495 cid_5308217 prop-2-enyl 3-methyl-4-oxo-6-(3,4,5-trimethoxyphenyl)-1,5,6,7-tetrahydroindole-2-carboxylate
TypeSmall organic molecule
Emp. Form.C22H25NO6
Mol. Mass.399.437
SMILESCOc1cc(cc(OC)c1OC)C1Cc2[nH]c(C(=O)OCC=C)c(C)c2C(=O)C1