Reaction Details
TargetProtein Wnt-3a
LigandBDBM65186
Substrate/Competitorn/a
IC50 279±n/a nM
Citation PubChem, PC Dose response validation of uHTS Gli-SUFU antagonist hits in a Wnt3a luminescent reporter assay PubChem Bioassay(2012)[AID]
 
Protein Wnt-3a
Name:Protein Wnt-3a
Type:PROTEIN
Mol. Mass.:39269.29
Organism:Mus musculus
Description:ChEMBL_813156
Residue:352
BDBM65186
NameBDBM65186
Synonyms:Dodecyl-dimethyl-prop-2-ynyl-ammonium SMR000217471 dodecyl-dimethyl-prop-2-ynyl-azanium;bromide dodecyl-dimethyl-prop-2-ynylazanium;bromide | lauryl-dimethyl-propargyl-ammonium;bromide
TypeSmall organic molecule
Emp. Form.C17H34N
Mol. Mass.252.458
SMILESCCCCCCCCCCCC[N+](C)(C)CC#C