Reaction Details
TargetProtein Wnt-3a
LigandBDBM88680
Substrate/Competitorn/a
IC50 11800±n/a nM
Citation PubChem, PC Dose response validation of uHTS Gli-SUFU antagonist hits in a Wnt3a luminescent reporter assay PubChem Bioassay(2012)[AID]
 
Protein Wnt-3a
Name:Protein Wnt-3a
Type:PROTEIN
Mol. Mass.:39269.29
Organism:Mus musculus
Description:ChEMBL_813156
Residue:352
BDBM88680
NameBDBM88680
Synonyms:1,2-bis(diethoxyphosphoryl)ethane;dichloro(diethyl)stannane SMR001566738 cid_371346
TypeSmall organic molecule
Emp. Form.C10H24O6P2
Mol. Mass.302.2415
SMILESCCOP(=O)(CCP(=O)(OCC)OCC)OCC