Reaction Details
TargetEndothelial PAS domain-containing protein 1
LigandBDBM36972
Substrate/Competitorn/a
IC50 1700±n/a nM
Citation PubChem, PC Dose response confirmation of uHTS identification of HIF-2a Inhibitors in a luminesence assay PubChem Bioassay(2012)[AID]
 
Endothelial PAS domain-containing protein 1
Name:Endothelial PAS domain-containing protein 1
Type:PROTEIN
Mol. Mass.:96453.58
Organism:Homo sapiens (Human)
Description:ChEMBL_1506501
Residue:870
BDBM36972
NameBDBM36972
Synonyms:2-[4-[(2-isopropyl-5-methyl-phenoxy)methyl]phenyl]-1,3,4-oxadiazole 2-[4-[(5-methyl-2-propan-2-ylphenoxy)methyl]phenyl]-1,3,4-oxadiazole SMR000062088 | cid_2372914
TypeSmall organic molecule
Emp. Form.C19H20N2O2
Mol. Mass.308.3743
SMILESCC(C)c1ccc(C)cc1OCc1ccc(cc1)-c1nnco1