Reaction Details
TargetEndothelial PAS domain-containing protein 1
LigandBDBM93959
Substrate/Competitorn/a
IC50 1810±n/a nM
Citation PubChem, PC Dose response confirmation of uHTS identification of HIF-2a Inhibitors in a luminesence assay PubChem Bioassay(2012)[AID]
 
Endothelial PAS domain-containing protein 1
Name:Endothelial PAS domain-containing protein 1
Type:PROTEIN
Mol. Mass.:96453.58
Organism:Homo sapiens (Human)
Description:ChEMBL_1506501
Residue:870
BDBM93959
NameBDBM93959
Synonyms:3-(5,7-dimethyl-2-phenyl-6-pyrazolo[1,5-a]pyrimidinyl)-N-(2-furanylmethyl)propanamide 3-(5,7-dimethyl-2-phenyl-pyrazolo[1,5-a]pyrimidin-6-yl)-N-(furan-2-ylmethyl)propanamide MLS000522521 cid_9550752
TypeSmall organic molecule
Emp. Form.C22H22N4O2
Mol. Mass.374.4357
SMILESCc1nc2cc(nn2c(C)c1CCC(=O)NCc1ccco1)-c1ccccc1