Reaction Details
TargetEndothelial PAS domain-containing protein 1
LigandBDBM65990
Substrate/Competitorn/a
IC50 8100±n/a nM
Citation PubChem, PC Dose response confirmation of uHTS identification of HIF-2a Inhibitors in a luminesence assay PubChem Bioassay(2012)[AID]
 
Endothelial PAS domain-containing protein 1
Name:Endothelial PAS domain-containing protein 1
Type:PROTEIN
Mol. Mass.:96453.58
Organism:Homo sapiens (Human)
Description:ChEMBL_1506501
Residue:870
BDBM65990
NameBDBM65990
Synonyms:3-[2,5-bis(oxidanylidene)pyrrol-1-yl]-N-(2,4-dichlorophenyl)benzamide N-(2,4-dichlorophenyl)-3-(2,5-dioxo-1-pyrrolyl)benzamide N-(2,4-dichlorophenyl)-3-(2,5-dioxopyrrol-1-yl)benzamide SMR000194626 | cid_2275069
TypeSmall organic molecule
Emp. Form.C17H10Cl2N2O3
Mol. Mass.361.179
SMILESClc1ccc(NC(=O)c2cccc(c2)N2C(=O)C=CC2=O)c(Cl)c1