Reaction Details
TargetEndothelial PAS domain-containing protein 1
LigandBDBM93995
Substrate/Competitorn/a
IC50 978±n/a nM
Citation PubChem, PC Dose response confirmation of uHTS identification of HIF-2a Inhibitors in a luminesence assay PubChem Bioassay(2012)[AID]
 
Endothelial PAS domain-containing protein 1
Name:Endothelial PAS domain-containing protein 1
Type:PROTEIN
Mol. Mass.:96453.58
Organism:Homo sapiens (Human)
Description:ChEMBL_1506501
Residue:870
BDBM93995
NameBDBM93995
Synonyms:1-(3-nitrobenzyl)-1H-indole-3-carbaldehyde 1-[(3-nitrophenyl)methyl]-3-indolecarboxaldehyde MLS000681232 cid_883348
TypeSmall organic molecule
Emp. Form.C16H12N2O3
Mol. Mass.280.2781
SMILES[O-][N+](=O)c1cccc(Cn2cc(C=O)c3ccccc23)c1