Reaction Details
TargetEndothelial PAS domain-containing protein 1
LigandBDBM94039
Substrate/Competitorn/a
IC50 452±n/a nM
Citation PubChem, PC Dose response confirmation of uHTS identification of HIF-2a Inhibitors in a luminesence assay PubChem Bioassay(2012)[AID]
 
Endothelial PAS domain-containing protein 1
Name:Endothelial PAS domain-containing protein 1
Type:PROTEIN
Mol. Mass.:96453.58
Organism:Homo sapiens (Human)
Description:ChEMBL_1506501
Residue:870
BDBM94039
NameBDBM94039
Synonyms:2-(2,4-Dimethyl-phenyl)-2H-benzotriazol-5-ylamine 2-(2,4-dimethylphenyl)benzotriazol-5-amine SMR000513166 cid_802111
TypeSmall organic molecule
Emp. Form.C14H14N4
Mol. Mass.238.2878
SMILESCc1ccc(c(C)c1)-n1nc2ccc(N)cc2n1