Reaction Details
TargetCorticotropin-releasing factor-binding protein
LigandBDBM90408
Substrate/Competitorn/a
IC50 1790±n/a nM
Citation PubChem, PC Dose Response confirmation of uHTS hits for small molecule antagonists of the CRF-binding protein and CRF-R2 receptor complex in 384 well format PubChem Bioassay(2012)[AID]
 
Corticotropin-releasing factor-binding protein
Name:Corticotropin-releasing factor-binding protein
Type:Enzyme Catalytic Domain
Mol. Mass.:36143.95
Organism:Homo sapiens (Human)
Description:P24387
Residue:322
BDBM90408
NameBDBM90408
Synonyms:MLS000672418 N-(2-methoxy-5-nitro-phenyl)-2-methylsulfanyl-benzamide N-(2-methoxy-5-nitrophenyl)-2-methylsulfanylbenzamide cid_2227244
TypeSmall organic molecule
Emp. Form.C15H14N2O4S
Mol. Mass.318.348
SMILESCOc1ccc(cc1NC(=O)c1ccccc1SC)[N+]([O-])=O