Reaction Details
TargetCorticotropin-releasing factor-binding protein
LigandBDBM72369
Substrate/Competitorn/a
IC50 5420±n/a nM
Citation PubChem, PC Dose Response confirmation of uHTS hits for small molecule antagonists of the CRF-binding protein and CRF-R2 receptor complex in 384 well format PubChem Bioassay(2012)[AID]
 
Corticotropin-releasing factor-binding protein
Name:Corticotropin-releasing factor-binding protein
Type:Enzyme Catalytic Domain
Mol. Mass.:36143.95
Organism:Homo sapiens (Human)
Description:P24387
Residue:322
BDBM72369
NameBDBM72369
Synonyms:5-nitro-2-(phenylthio)pyridine 5-nitro-2-phenylsulfanylpyridine SMR000271839 | cid_699570
TypeSmall organic molecule
Emp. Form.C11H8N2O2S
Mol. Mass.232.258
SMILES[O-][N+](=O)c1ccc(Sc2ccccc2)nc1