Reaction Details
TargetCorticotropin-releasing factor-binding protein
LigandBDBM91360
Substrate/Competitorn/a
IC50 4280±n/a nM
Citation PubChem, PC Dose Response confirmation of uHTS hits for small molecule antagonists of the CRF-binding protein and CRF-R2 receptor complex in 384 well format PubChem Bioassay(2012)[AID]
 
Corticotropin-releasing factor-binding protein
Name:Corticotropin-releasing factor-binding protein
Type:Enzyme Catalytic Domain
Mol. Mass.:36143.95
Organism:Homo sapiens (Human)
Description:P24387
Residue:322
BDBM91360
NameBDBM91360
Synonyms:(1S,3R,12bS)-9-chloranyl-3-[2-[2-(cyclohexen-1-yl)ethylamino]-2-oxidanylidene-ethyl]-12b-methyl-4-oxidanylidene-N,N-di(propan-2-yl)-1,2,3,6,7,12-hexahydroindolo[2,3-a]quinolizine-1-carboxamide (1S,3R,12bS)-9-chloro-3-[2-[2-(cyclohexen-1-yl)ethylamino]-2-keto-ethyl]-N,N-diisopropyl-4-keto-12b-methyl-1,2,3,6,7,12-hexahydropyrido[2,1-a]-carboline-1-carboxamide MLS002610954 cid_44601644
TypeSmall organic molecule
Emp. Form.C33H45ClN4O3
Mol. Mass.581.188
SMILESCC(C)N(C(C)C)C(=O)[C@H]1C[C@H](CC(=O)NCCC2=CCCCC2)C(=O)N2CCc3c([nH]c4ccc(Cl)cc34)[C@]12C