Reaction Details
TargetCorticotropin-releasing factor-binding protein
LigandBDBM89733
Substrate/Competitorn/a
IC50 3480±n/a nM
Citation PubChem, PC Dose Response confirmation of uHTS hits for small molecule antagonists of the CRF-binding protein and CRF-R2 receptor complex in 384 well format PubChem Bioassay(2012)[AID]
 
Corticotropin-releasing factor-binding protein
Name:Corticotropin-releasing factor-binding protein
Type:Enzyme Catalytic Domain
Mol. Mass.:36143.95
Organism:Homo sapiens (Human)
Description:P24387
Residue:322
BDBM89733
NameBDBM89733
Synonyms:1-(2,5-dimethoxyphenyl)sulfonyl-2-methyl-2,3-dihydroindole 1-[(2,5-dimethoxyphenyl)sulfonyl]-2-methylindoline SMR000073745 | cid_2943266
TypeSmall organic molecule
Emp. Form.C17H19NO4S
Mol. Mass.333.402
SMILESCOc1ccc(OC)c(c1)S(=O)(=O)N1C(C)Cc2ccccc12