Reaction Details
TargetCorticotropin-releasing factor-binding protein
LigandBDBM90508
Substrate/Competitorn/a
IC50 3740±n/a nM
Citation PubChem, PC Dose Response confirmation of uHTS hits for small molecule antagonists of the CRF-binding protein and CRF-R2 receptor complex in 384 well format PubChem Bioassay(2012)[AID]
 
Corticotropin-releasing factor-binding protein
Name:Corticotropin-releasing factor-binding protein
Type:Enzyme Catalytic Domain
Mol. Mass.:36143.95
Organism:Homo sapiens (Human)
Description:P24387
Residue:322
BDBM90508
NameBDBM90508
Synonyms:2-(3,5-dimethylanilino)-3,4,5,6-tetrafluoro-benzoic acid 2-[(3,5-dimethylphenyl)amino]-3,4,5,6-tetrafluorobenzoic acid MLS000689735 cid_4549148
TypeSmall organic molecule
Emp. Form.C15H11F4NO2
Mol. Mass.313.247
SMILESCc1cc(C)cc(Nc2c(F)c(F)c(F)c(F)c2C(O)=O)c1