Reaction Details
TargetCorticotropin-releasing factor-binding protein
LigandBDBM91148
Substrate/Competitorn/a
IC50 4530±n/a nM
Citation PubChem, PC Dose Response confirmation of uHTS hits for small molecule antagonists of the CRF-binding protein and CRF-R2 receptor complex in 384 well format PubChem Bioassay(2012)[AID]
 
Corticotropin-releasing factor-binding protein
Name:Corticotropin-releasing factor-binding protein
Type:Enzyme Catalytic Domain
Mol. Mass.:36143.95
Organism:Homo sapiens (Human)
Description:P24387
Residue:322
BDBM91148
NameBDBM91148
Synonyms:2-(4-carbethoxyphenyl)imino-4-keto-3-(3-morpholinopropyl)-1,3-thiazine-6-carboxylic acid methyl ester;hydrochloride MLS001367603 cid_6603300 methyl 2-(4-ethoxycarbonylphenyl)imino-3-(3-morpholin-4-ylpropyl)-4-oxidanylidene-1,3-thiazine-6-carboxylate;hydrochloride | methyl 2-(4-ethoxycarbonylphenyl)imino-3-(3-morpholin-4-ylpropyl)-4-oxo-1,3-thiazine-6-carboxylate;hydrochloride
TypeSmall organic molecule
Emp. Form.C22H27N3O6S
Mol. Mass.461.531
SMILESCCOC(=O)c1ccc(cc1)\N=c1/sc(cc(=O)n1CCCN1CCOCC1)C(=O)OC