Reaction Details
TargetCorticotropin-releasing factor-binding protein
LigandBDBM89544
Substrate/Competitorn/a
IC50 3720±n/a nM
Citation PubChem, PC Dose Response confirmation of uHTS hits for small molecule antagonists of the CRF-binding protein and CRF-R2 receptor complex in 384 well format PubChem Bioassay(2012)[AID]
 
Corticotropin-releasing factor-binding protein
Name:Corticotropin-releasing factor-binding protein
Type:Enzyme Catalytic Domain
Mol. Mass.:36143.95
Organism:Homo sapiens (Human)
Description:P24387
Residue:322
BDBM89544
NameBDBM89544
Synonyms:(2,4-Dimethoxy-phenyl)-[6-(2-fluoro-phenyl)-pyridazin-3-yl]-amine MLS000075679 N-(2,4-dimethoxyphenyl)-6-(2-fluorophenyl)pyridazin-3-amine cid_653238
TypeSmall organic molecule
Emp. Form.C18H16FN3O2
Mol. Mass.325.3369
SMILESCOc1ccc(Nc2ccc(nn2)-c2ccccc2F)c(OC)c1