Reaction Details
TargetCorticotropin-releasing factor-binding protein
LigandBDBM91001
Substrate/Competitorn/a
IC50 1510±n/a nM
Citation PubChem, PC Dose Response confirmation of uHTS hits for small molecule antagonists of the CRF-binding protein and CRF-R2 receptor complex in 384 well format PubChem Bioassay(2012)[AID]
 
Corticotropin-releasing factor-binding protein
Name:Corticotropin-releasing factor-binding protein
Type:Enzyme Catalytic Domain
Mol. Mass.:36143.95
Organism:Homo sapiens (Human)
Description:P24387
Residue:322
BDBM91001
NameBDBM91001
Synonyms:2-furanyl-[3-(2-hydroxy-3-methoxyphenyl)-5-thiophen-2-yl-3,4-dihydropyrazol-2-yl]methanone Furan-2-yl-[5-(2-hydroxy-3-methoxy-phenyl)-3-thiophen-2-yl-4,5-dihydro-pyrazol-1-yl]-methanone SMR000613239 furan-2-yl-[3-(2-hydroxy-3-methoxyphenyl)-5-thiophen-2-yl-3,4-dihydropyrazol-2-yl]methanone | furan-2-yl-[3-(3-methoxy-2-oxidanyl-phenyl)-5-thiophen-2-yl-3,4-dihydropyrazol-2-yl]methanone
TypeSmall organic molecule
Emp. Form.C19H16N2O4S
Mol. Mass.368.406
SMILESCOc1cccc(C2CC(=NN2C(=O)c2ccco2)c2cccs2)c1O