Reaction Details
TargetCorticotropin-releasing factor-binding protein
LigandBDBM78182
Substrate/Competitorn/a
IC50 5100±n/a nM
Citation PubChem, PC Dose Response confirmation of uHTS hits for small molecule antagonists of the CRF-binding protein and CRF-R2 receptor complex in 384 well format PubChem Bioassay(2012)[AID]
 
Corticotropin-releasing factor-binding protein
Name:Corticotropin-releasing factor-binding protein
Type:Enzyme Catalytic Domain
Mol. Mass.:36143.95
Organism:Homo sapiens (Human)
Description:P24387
Residue:322
BDBM78182
NameBDBM78182
Synonyms:2-(3,4-dichlorophenyl)-N'-[(3,4-dimethoxybenzoyl)oxy]ethanimidamide MLS000578928 [(Z)-[1-amino-2-(3,4-dichlorophenyl)ethylidene]amino] 3,4-dimethoxybenzoate cid_9587530
TypeSmall organic molecule
Emp. Form.C17H16Cl2N2O4
Mol. Mass.383.226
SMILESCOc1ccc(cc1OC)C(=O)ON=C(N)Cc1ccc(Cl)c(Cl)c1