Reaction Details
TargetPerilipin-1
LigandBDBM94560
Substrate/Competitorn/a
IC50 964±n/a nM
Citation PubChem, PC Counterscreen for inhibitors of the interaction of the lipase co-activator protein, abhydrolase domain containing 5 (ABHD5) with perilipin-5 (MLDP; PLIN5) PubChem Bioassay(2012)[AID]
 
Perilipin-1
Name:Perilipin-1
Type:Enzyme Catalytic Domain
Mol. Mass.:55988.69
Organism:Homo sapiens (Human)
Description:gi_223718203
Residue:522
BDBM94560
NameBDBM94560
Synonyms:MLS003674207 N-cyclohexyl-2-[3-(2-furyl)-2-keto-quinoxalin-1-yl]-2-phenyl-acetamide N-cyclohexyl-2-[3-(furan-2-yl)-2-oxoquinoxalin-1-yl]-2-phenylacetamide cid_53383332
TypeSmall organic molecule
Emp. Form.C26H25N3O3
Mol. Mass.427.495
SMILESO=C(NC1CCCCC1)C(c1ccccc1)n1c2ccccc2nc(-c2ccco2)c1=O