Reaction Details
TargetPerilipin-1
LigandBDBM49749
Substrate/Competitorn/a
IC50 800.55±n/a nM
Citation PubChem, PC Counterscreen for inhibitors of the interaction of the lipase co-activator protein, abhydrolase domain containing 5 (ABHD5) with perilipin-5 (MLDP; PLIN5) PubChem Bioassay(2012)[AID]
 
Perilipin-1
Name:Perilipin-1
Type:Enzyme Catalytic Domain
Mol. Mass.:55988.69
Organism:Homo sapiens (Human)
Description:gi_223718203
Residue:522
BDBM49749
NameBDBM49749
Synonyms:7-methyl-1,3-dinitro-acridine MLS000728238 cid_4222770
TypeSmall organic molecule
Emp. Form.C14H9N3O4
Mol. Mass.283.239
SMILESCc1ccc2nc3cc(cc([N+]([O-])=O)c3cc2c1)[N+]([O-])=O