Reaction Details
TargetPerilipin-1
LigandBDBM94594
Substrate/Competitorn/a
IC50 1289±n/a nM
Citation PubChem, PC Counterscreen for inhibitors of the interaction of the lipase co-activator protein, abhydrolase domain containing 5 (ABHD5) with perilipin-5 (MLDP; PLIN5) PubChem Bioassay(2012)[AID]
 
Perilipin-1
Name:Perilipin-1
Type:Enzyme Catalytic Domain
Mol. Mass.:55988.69
Organism:Homo sapiens (Human)
Description:gi_223718203
Residue:522
BDBM94594
NameBDBM94594
Synonyms:2-(1-benzofuran-2-yl)-N-cyclohexyl-2-[3-(furan-2-yl)-2-oxidanylidene-quinoxalin-1-yl]ethanamide 2-(2-benzofuranyl)-N-cyclohexyl-2-[3-(2-furanyl)-2-oxo-1-quinoxalinyl]acetamide MLS003674202 cid_53383327
TypeSmall organic molecule
Emp. Form.C28H25N3O4
Mol. Mass.467.5158
SMILESO=C(NC1CCCCC1)C(c1cc2ccccc2o1)n1c2ccccc2nc(-c2ccco2)c1=O