Reaction Details
TargetPerilipin-1
LigandBDBM88500
Substrate/Competitorn/a
IC50 1251±n/a nM
Citation PubChem, PC Counterscreen for inhibitors of the interaction of the lipase co-activator protein, abhydrolase domain containing 5 (ABHD5) with perilipin-5 (MLDP; PLIN5) PubChem Bioassay(2012)[AID]
 
Perilipin-1
Name:Perilipin-1
Type:Enzyme Catalytic Domain
Mol. Mass.:55988.69
Organism:Homo sapiens (Human)
Description:gi_223718203
Residue:522
BDBM88500
NameBDBM88500
Synonyms:3-hydroxybutanoic acid [(3aS,3bR,5aS,9aS,9bR,11aS)-2-(2-hydroxy-5-oxo-2H-furan-3-yl)-3b,6,6,9a-tetramethyl-2,3,3a,4,5,5a,7,8,9,9b,10,11-dodecahydronaphtho[2,1-e]benzofuran-11a-yl]methyl ester MLS001250237 [(3aS,3bR,5aS,9aS,9bR,11aS)-2-(2-hydroxy-5-oxo-2H-furan-3-yl)-3b,6,6,9a-tetramethyl-2,3,3a,4,5,5a,7,8,9,9b,10,11-dodecahydronaphtho[2,1-e][1]benzofuran-11a-yl]methyl 3-hydroxybutanoate cid_46902089
TypeSmall organic molecule
Emp. Form.C29H44O7
Mol. Mass.504.6555
SMILESCC(O)CC(=O)OC[C@]12CC[C@H]3[C@@](C)(CC[C@H]4C(C)(C)CCC[C@]34C)[C@@H]1CC(O2)C1=CC(=O)OC1O