Reaction Details
TargetPerilipin-1
LigandBDBM94633
Substrate/Competitorn/a
IC50 1059±n/a nM
Citation PubChem, PC Counterscreen for inhibitors of the interaction of the lipase co-activator protein, abhydrolase domain containing 5 (ABHD5) with perilipin-5 (MLDP; PLIN5) PubChem Bioassay(2012)[AID]
 
Perilipin-1
Name:Perilipin-1
Type:Enzyme Catalytic Domain
Mol. Mass.:55988.69
Organism:Homo sapiens (Human)
Description:gi_223718203
Residue:522
BDBM94633
NameBDBM94633
Synonyms:2-[4-(1,3-benzodioxol-5-yl)-2-ethyl-2-methyl-5,6-dihydro-1H-pyrimidin-6-yl]phenol SMR000132574 | cid_4148491
TypeSmall organic molecule
Emp. Form.C20H22N2O3
Mol. Mass.338.4003
SMILESCCC1(C)NC(CC(=N1)c1ccc2OCOc2c1)c1ccccc1O