Reaction Details
TargetPerilipin-5
LigandBDBM34677
Substrate/Competitorn/a
IC50 2531±n/a nM
Citation PubChem, PC Luminescence-based biochemical high throughput dose response assay for inhibitors of the interaction of the lipase co-activator protein, abhydrolase domain containing 5 (ABHD5) with perilipin-5 (MLDP; PLIN5) PubChem Bioassay(2012)[AID]
 
Perilipin-5
Name:Perilipin-5
Type:Enzyme Catalytic Domain
Mol. Mass.:50774.20
Organism:Homo sapiens (Human)
Description:gi_116292172
Residue:463
BDBM34677
NameBDBM34677
Synonyms:3-(4-methylbenzoyl)benzo[g][1]benzofuran-4,5-dione 3-(4-methylphenyl)carbonylbenzo[g][1]benzofuran-4,5-dione 3-p-toluoylbenzo[g]benzofuran-4,5-quinone SMR000137097 | cid_1736341
TypeSmall organic molecule
Emp. Form.C20H12O4
Mol. Mass.316.3069
SMILESCc1ccc(cc1)C(=O)c1coc-2c1C(=O)C(=O)c1ccccc-21