Reaction Details
TargetPerilipin-5
LigandBDBM34683
Substrate/Competitorn/a
IC50 2933±n/a nM
Citation PubChem, PC Luminescence-based biochemical high throughput dose response assay for inhibitors of the interaction of the lipase co-activator protein, abhydrolase domain containing 5 (ABHD5) with perilipin-5 (MLDP; PLIN5) PubChem Bioassay(2012)[AID]
 
Perilipin-5
Name:Perilipin-5
Type:Enzyme Catalytic Domain
Mol. Mass.:50774.20
Organism:Homo sapiens (Human)
Description:gi_116292172
Residue:463
BDBM34683
NameBDBM34683
Synonyms:3-(phenylcarbonyl)benzo[g][1]benzofuran-4,5-dione 3-benzoylbenzo[g]benzofuran-4,5-dione 3-benzoylnaphtho[1,2-b]furan-4,5-dione SMR000137100 | cid_1895639
TypeSmall organic molecule
Emp. Form.C19H10O4
Mol. Mass.302.2803
SMILESO=C(c1coc-2c1C(=O)C(=O)c1ccccc-21)c1ccccc1