Reaction Details
TargetSentrin-specific protease 1
LigandBDBM46276
Substrate/Competitorn/a
IC50 12800±n/a nM
Citation PubChem, PC Dose response confirmation of small molecule inhibitors of the catalytic domain of the SUMO protease, SENP1 in a FRET assay PubChem Bioassay(2012)[AID]
 
Sentrin-specific protease 1
Name:Sentrin-specific protease 1
Type:Protein
Mol. Mass.:73500.42
Organism:Homo sapiens (Human)
Description:Q9P0U3
Residue:644
BDBM46276
NameBDBM46276
Synonyms:2-[2,6-bis(chloranyl)-4-[(Z)-[6-ethoxycarbonyl-5-(3-methoxyphenyl)-7-methyl-3-oxidanylidene-5H-[1,3]thiazolo[3,2-a]pyrimidin-2-ylidene]methyl]phenoxy]ethanoic acid 2-[2,6-dichloro-4-[(Z)-[6-ethoxycarbonyl-5-(3-methoxyphenyl)-7-methyl-3-oxo-5H-thiazolo[3,2-a]pyrimidin-2-ylidene]methyl]phenoxy]acetic acid MLS-0425590.0001 | cid_6000533
TypeSmall organic molecule
Emp. Form.C26H22Cl2N2O7S
Mol. Mass.577.433
SMILESCCOC(=O)C1=C(C)N=c2s\c(=C/c3cc(Cl)c(OCC(O)=O)c(Cl)c3)c(=O)n2C1c1cccc(OC)c1