Reaction Details
TargetLow molecular weight phosphotyrosine protein phosphatase
LigandBDBM55075
Substrate/Competitorn/a
IC50 2980±n/a nM
Citation PubChem, PC Dose response confirmation of small molecule inhibitors of Low Molecular Weight Protein Tyrosine Phosphatase, LMPTP, via a fluorescence intensity assay PubChem Bioassay(2012)[AID]
 
Low molecular weight phosphotyrosine protein phosphatase
Name:Low molecular weight phosphotyrosine protein phosphatase
Type:n/a
Mol. Mass.:18042.81
Organism:Homo sapiens (Human)
Description:P24666
Residue:158
BDBM55075
NameBDBM55075
Synonyms:3-(5-methylfuran-2-yl)carbonyl-1-(5-methyl-1,2-oxazol-3-yl)-4-oxidanyl-2-(4-phenylmethoxyphenyl)-2H-pyrrol-5-one 4-hydroxy-3-[(5-methyl-2-furanyl)-oxomethyl]-1-(5-methyl-3-isoxazolyl)-2-(4-phenylmethoxyphenyl)-2H-pyrrol-5-one MLS001147817 cid_3496625
TypeSmall organic molecule
Emp. Form.C27H22N2O6
Mol. Mass.470.4734
SMILESCc1ccc(o1)C(=O)C1C(N(C(=O)C1=O)c1cc(C)on1)c1ccc(OCc2ccccc2)cc1