Reaction Details
TargetLow molecular weight phosphotyrosine protein phosphatase
LigandBDBM46245
Substrate/Competitorn/a
IC50 32700±n/a nM
Citation PubChem, PC Dose response confirmation of small molecule inhibitors of Low Molecular Weight Protein Tyrosine Phosphatase, LMPTP, via a fluorescence intensity assay PubChem Bioassay(2012)[AID]
 
Low molecular weight phosphotyrosine protein phosphatase
Name:Low molecular weight phosphotyrosine protein phosphatase
Type:n/a
Mol. Mass.:18042.81
Organism:Homo sapiens (Human)
Description:P24666
Residue:158
BDBM46245
NameBDBM46245
Synonyms:4-keto-5-methyl-2-[(E)-2-(4-methyl-3-nitro-phenyl)vinyl]-3H-thieno[2,3-d]pyrimidine-6-carboxylic acid 5-methyl-2-[(E)-2-(4-methyl-3-nitrophenyl)ethenyl]-4-oxo-3H-thieno[2,3-d]pyrimidine-6-carboxylic acid cid_8853383
TypeSmall organic molecule
Emp. Form.C17H13N3O5S
Mol. Mass.371.367
SMILESCc1c(sc2nc(C=Cc3ccc(C)c(c3)[N+]([O-])=O)[nH]c(=O)c12)C(O)=O