Reaction Details
TargetLow molecular weight phosphotyrosine protein phosphatase
LigandBDBM94981
Substrate/Competitorn/a
IC50 2590±n/a nM
Citation PubChem, PC Dose response confirmation of small molecule inhibitors of Low Molecular Weight Protein Tyrosine Phosphatase, LMPTP, via a fluorescence intensity assay PubChem Bioassay(2012)[AID]
 
Low molecular weight phosphotyrosine protein phosphatase
Name:Low molecular weight phosphotyrosine protein phosphatase
Type:n/a
Mol. Mass.:18042.81
Organism:Homo sapiens (Human)
Description:P24666
Residue:158
BDBM94981
NameBDBM94981
Synonyms:1-methyl-6H-pyrido[4,3-b]carbazole SMR001798128 | cid_5382484
TypeSmall organic molecule
Emp. Form.C16H12N2
Mol. Mass.232.2799
SMILESCc1nccc2cc3[nH]c4ccccc4c3cc12