Reaction Details
TargetHepatocyte nuclear factor 4-alpha
LigandBDBM34693
Substrate/Competitorn/a
IC50 3576±n/a nM
Citation PubChem, PC Counterscreen for inhibitors of the interaction of the lipase co-activator protein, abhydrolase domain containing 5 (ABHD5) with perilipin-5 (MLDP; PLIN5): Luminescence-based biochemical high throughput dose response assay to identify inhibitors of Hepatocyte nuclear factor 4 (HNF4) dimerization PubChem Bioassay(2012)[AID]
 
Hepatocyte nuclear factor 4-alpha
Name:Hepatocyte nuclear factor 4-alpha
Type:PROTEIN
Mol. Mass.:52790.24
Organism:Homo sapiens (Human)
Description:ChEMBL_606516
Residue:474
BDBM34693
NameBDBM34693
Synonyms:3-(4-Chloro-benzoyl)-2-methyl-naphtho[1,2-b]furan-4,5-dione 3-(4-chlorobenzoyl)-2-methylbenzo[g][1]benzofuran-4,5-dione 3-[(4-chlorophenyl)-oxomethyl]-2-methylbenzo[g]benzofuran-4,5-dione SMR000146424 | cid_3698299
TypeSmall organic molecule
Emp. Form.C20H11ClO4
Mol. Mass.350.752
SMILESCc1oc-2c(c1C(=O)c1ccc(Cl)cc1)C(=O)C(=O)c1ccccc-21