Reaction Details
TargetC-C chemokine receptor type 5
LigandBDBM84215
Substrate/Competitorn/a
EC50 188±n/a nM
Citation PubChem, PC Counter screen for HTS for Beta-2AR agonists with FAP-tagged human CCR5 with Powderset2 PubChem Bioassay(2012)[AID]
 
C-C chemokine receptor type 5
Name:C-C chemokine receptor type 5
Type:Enzyme
Mol. Mass.:40540.21
Organism:Homo sapiens (Human)
Description:P51681
Residue:352
BDBM84215
NameBDBM84215
Synonyms:4-[[1-oxo-2-[4-(1-pyrrolidinylsulfonyl)phenoxy]ethyl]amino]benzoic acid ethyl ester 4-{2-[4-(Pyrrolidine-1-sulfonyl)-phenoxy]-acetylamino}-benzoic acid ethyl ester SMR000124597 ethyl 4-[2-(4-pyrrolidin-1-ylsulfonylphenoxy)ethanoylamino]benzoate | ethyl 4-[[2-(4-pyrrolidin-1-ylsulfonylphenoxy)acetyl]amino]benzoate
TypeSmall organic molecule
Emp. Form.C21H24N2O6S
Mol. Mass.432.49
SMILESCCOC(=O)c1ccc(NC(=O)COc2ccc(cc2)S(=O)(=O)N2CCCC2)cc1