Reaction Details
TargetC-C chemokine receptor type 5
LigandBDBM84321
Substrate/Competitorn/a
EC50 7.46±n/a nM
Citation PubChem, PC Counter screen for HTS for Beta-2AR agonists with FAP-tagged human CCR5 with Powderset2 PubChem Bioassay(2012)[AID]
 
C-C chemokine receptor type 5
Name:C-C chemokine receptor type 5
Type:Enzyme
Mol. Mass.:40540.21
Organism:Homo sapiens (Human)
Description:P51681
Residue:352
BDBM84321
NameBDBM84321
Synonyms:4-Chloro-N-methyl-N-[2-oxo-2-(4-pyridin-2-yl-piperazin-1-yl)-ethyl]-benzenesulfonamide 4-chloro-N-[2-keto-2-[4-(2-pyridyl)piperazino]ethyl]-N-methyl-benzenesulfonamide 4-chloro-N-methyl-N-[2-oxo-2-[4-(2-pyridinyl)-1-piperazinyl]ethyl]benzenesulfonamide SMR000613536 | cid_3164412
TypeSmall organic molecule
Emp. Form.C18H21ClN4O3S
Mol. Mass.408.902
SMILESCN(CC(=O)N1CCN(CC1)c1ccccn1)S(=O)(=O)c1ccc(Cl)cc1