Reaction Details
TargetEnvelope glycoprotein gp160
LigandBDBM95265
Substrate/Competitorn/a
IC50 3662±n/a nM
Citation PubChem, PC Counterscreen for discovery of small molecules that bind to the HIV-1-gp120 binding antibody, PG9 PubChem Bioassay(2012)[AID]
 
Envelope glycoprotein gp160
Name:Envelope glycoprotein gp160
Type:n/a
Mol. Mass.:97241.93
Organism:Human immunodeficiency virus type 1 group M subtype B (isolate HXB2)
Description:n/a
Residue:856
BDBM95265
NameBDBM95265
Synonyms:2-(4-morpholinophenyl)quinoline 4-[4-(2-quinolinyl)phenyl]morpholine MLS000547365 cid_1472976
TypeSmall organic molecule
Emp. Form.C19H18N2O
Mol. Mass.290.359
SMILESC1CN(CCO1)c1ccc(cc1)-c1ccc2ccccc2n1