Reaction Details
TargetEnvelope glycoprotein gp160
LigandBDBM95266
Substrate/Competitorn/a
IC50 2417±n/a nM
Citation PubChem, PC Counterscreen for discovery of small molecules that bind to the HIV-1-gp120 binding antibody, PG9 PubChem Bioassay(2012)[AID]
 
Envelope glycoprotein gp160
Name:Envelope glycoprotein gp160
Type:n/a
Mol. Mass.:97241.93
Organism:Human immunodeficiency virus type 1 group M subtype B (isolate HXB2)
Description:n/a
Residue:856
BDBM95266
NameBDBM95266
Synonyms:(2E)-1-(4-methoxyphenyl)-2-(7-methyl-[1,3]dioxolo[4,5-f][1,3]benzothiazol-6-ylidene)ethanone MLS000577032 cid_2185557
TypeSmall organic molecule
Emp. Form.C18H15NO4S
Mol. Mass.341.381
SMILESCOc1ccc(cc1)C(=O)\C=C1\Sc2cc3OCOc3cc2N1C