Reaction Details
TargetEnvelope glycoprotein gp160
LigandBDBM95272
Substrate/Competitorn/a
IC50 49153±n/a nM
Citation PubChem, PC Counterscreen for discovery of small molecules that bind to the HIV-1-gp120 binding antibody, PG9 PubChem Bioassay(2012)[AID]
 
Envelope glycoprotein gp160
Name:Envelope glycoprotein gp160
Type:n/a
Mol. Mass.:97241.93
Organism:Human immunodeficiency virus type 1 group M subtype B (isolate HXB2)
Description:n/a
Residue:856
BDBM95272
NameBDBM95272
Synonyms:3-ethyl-5,5-dimethyl-2-sulfanylidene-1,6-dihydrobenzo[h]quinazolin-4-one MLS000765800 cid_719137
TypeSmall organic molecule
Emp. Form.C16H18N2OS
Mol. Mass.286.392
SMILESCCn1c(=S)[nH]c2-c3ccccc3CC(C)(C)c2c1=O