Reaction Details
TargetEnvelope glycoprotein gp160
LigandBDBM95296
Substrate/Competitorn/a
IC50 5444±n/a nM
Citation PubChem, PC Counterscreen for discovery of small molecules that bind to the HIV-1-gp120 binding antibody, PG9 PubChem Bioassay(2012)[AID]
 
Envelope glycoprotein gp160
Name:Envelope glycoprotein gp160
Type:n/a
Mol. Mass.:97241.93
Organism:Human immunodeficiency virus type 1 group M subtype B (isolate HXB2)
Description:n/a
Residue:856
BDBM95296
NameBDBM95296
Synonyms:(4E)-5-(3-bromophenyl)-4-[2,3-dihydro-1,4-benzodioxin-6-yl(hydroxy)methylene]-1-(3-imidazol-1-ylpropyl)pyrrolidine-2,3-quinone (4E)-5-(3-bromophenyl)-4-[2,3-dihydro-1,4-benzodioxin-6-yl(hydroxy)methylidene]-1-[3-(1-imidazolyl)propyl]pyrrolidine-2,3-dione MLS001139444 cid_5927505
TypeSmall organic molecule
Emp. Form.C25H22BrN3O5
Mol. Mass.524.363
SMILESBrc1cccc(c1)C1C(C(=O)c2ccc3OCCOc3c2)C(=O)C(=O)N1CCCn1ccnc1