Reaction Details
TargetEnvelope glycoprotein gp160
LigandBDBM42302
Substrate/Competitorn/a
IC50 13877±n/a nM
Citation PubChem, PC Counterscreen for discovery of small molecules that bind to the HIV-1-gp120 binding antibody, PG9 PubChem Bioassay(2012)[AID]
 
Envelope glycoprotein gp160
Name:Envelope glycoprotein gp160
Type:n/a
Mol. Mass.:97241.93
Organism:Human immunodeficiency virus type 1 group M subtype B (isolate HXB2)
Description:n/a
Residue:856
BDBM42302
NameBDBM42302
Synonyms:MLS000041013 N-(2,3-dihydro-1,4-benzodioxin-6-yl)-2-[(2-methyl-[1]benzofuro[3,2-d]pyrimidin-4-yl)sulfanyl]acetamide N-(2,3-dihydro-1,4-benzodioxin-6-yl)-2-[(2-methylbenzofuro[3,2-d]pyrimidin-4-yl)thio]acetamide cid_663539
TypeSmall organic molecule
Emp. Form.C21H17N3O4S
Mol. Mass.407.442
SMILESCc1nc(SCC(=O)Nc2ccc3OCCOc3c2)c2oc3ccccc3c2n1